Information card for entry 7035380
Formula | C40 H50.4 Ca2 N8 O17.2 |
Calculated formula | C40 H50.404 Ca2 N8 O17.202 |
Title of publication | Calcium and heterometallic manganese-calcium complexes supported by tripodal pyridine-carboxylate ligands: structural, EPR and theoretical investigations. |
Authors of publication | Gerey, Bertrand; Gennari, Marcello; Gouré, Eric; Pécaut, Jacques; Blackman, Allan; Pantazis, Dimitrios A.; Neese, Frank; Molton, Florian; Fortage, Jérôme; Duboc, Carole; Collomb, Marie-Noëlle |
Journal of publication | Dalton transactions (Cambridge, England : 2003) |
Year of publication | 2015 |
Journal volume | 44 |
Journal issue | 28 |
Pages of publication | 12757 - 12770 |
a | 10.1802 ± 0.0005 Å |
b | 23.6482 ± 0.0006 Å |
c | 10.262 ± 0.0004 Å |
α | 90° |
β | 113.84 ± 0.005° |
γ | 90° |
Cell volume | 2259.72 ± 0.18 Å3 |
Cell temperature | 150 ± 2 K |
Ambient diffraction temperature | 150 ± 2 K |
Number of distinct elements | 5 |
Space group number | 14 |
Hermann-Mauguin space group symbol | P 1 21/n 1 |
Hall space group symbol | -P 2yn |
Residual factor for all reflections | 0.0736 |
Residual factor for significantly intense reflections | 0.0466 |
Weighted residual factors for significantly intense reflections | 0.0817 |
Weighted residual factors for all reflections included in the refinement | 0.0916 |
Goodness-of-fit parameter for all reflections included in the refinement | 1.015 |
Diffraction radiation wavelength | 0.71073 Å |
Diffraction radiation type | MoKα |