Information card for entry 7035381
Formula | C25 H0 La O8 S2 |
Calculated formula | C25 La O8 S2 |
Title of publication | A microporous lanthanum metal-organic framework as a bi-functional chemosensor for the detection of picric acid and Fe(3+) ions. |
Authors of publication | Zhang, Chuanqi; Yan, Yan; Pan, Qinhe; Sun, Libo; He, Hongming; Liu, Yunling; Liang, Zhiqiang; Li, Jiyang |
Journal of publication | Dalton transactions (Cambridge, England : 2003) |
Year of publication | 2015 |
Journal volume | 44 |
Journal issue | 29 |
Pages of publication | 13340 - 13346 |
a | 33.4 ± 0.004 Å |
b | 13.8787 ± 0.0019 Å |
c | 13.579 ± 0.0016 Å |
α | 90° |
β | 104.966 ± 0.003° |
γ | 90° |
Cell volume | 6081 ± 1.3 Å3 |
Cell temperature | 296 ± 2 K |
Ambient diffraction temperature | 296 ± 2 K |
Number of distinct elements | 5 |
Space group number | 15 |
Hermann-Mauguin space group symbol | C 1 2/c 1 |
Hall space group symbol | -C 2yc |
Residual factor for all reflections | 0.077 |
Residual factor for significantly intense reflections | 0.0605 |
Weighted residual factors for significantly intense reflections | 0.1638 |
Weighted residual factors for all reflections included in the refinement | 0.1751 |
Goodness-of-fit parameter for all reflections included in the refinement | 1.005 |
Diffraction radiation wavelength | 0.71073 Å |
Diffraction radiation type | MoKα |