Information card for entry 7035397
Formula | C17 H12 N2 O3 |
Calculated formula | C17 H12 N2 O3 |
SMILES | C1(=O)C=Cc2ccccc2/C1=C/Nc1ccc(cc1)N(=O)=O |
Title of publication | Synthesis of a series of new platinum organometallic complexes derived from bidentate Schiff-base ligands and their catalytic activity in the hydrosilylation and dehydrosilylation of styrene. |
Authors of publication | Lachachi, M. Belhadj; Benabdallah, Tayeb; Aguiar, Pedro M.; Youcef, M. Hadj; Whitwood, Adrian C.; Lynam, Jason M. |
Journal of publication | Dalton transactions (Cambridge, England : 2003) |
Year of publication | 2015 |
Journal volume | 44 |
Journal issue | 26 |
Pages of publication | 11919 - 11928 |
a | 8.0204 ± 0.0002 Å |
b | 12.7917 ± 0.0003 Å |
c | 13.0855 ± 0.0004 Å |
α | 90° |
β | 98.087 ± 0.003° |
γ | 90° |
Cell volume | 1329.15 ± 0.06 Å3 |
Cell temperature | 110 ± 0.1 K |
Ambient diffraction temperature | 110 ± 0.1 K |
Number of distinct elements | 4 |
Space group number | 14 |
Hermann-Mauguin space group symbol | P 1 21/c 1 |
Hall space group symbol | -P 2ybc |
Residual factor for all reflections | 0.0512 |
Residual factor for significantly intense reflections | 0.0441 |
Weighted residual factors for significantly intense reflections | 0.1245 |
Weighted residual factors for all reflections included in the refinement | 0.1302 |
Goodness-of-fit parameter for all reflections included in the refinement | 1.073 |
Diffraction radiation wavelength | 0.7107 Å |
Diffraction radiation type | MoKα |