Information card for entry 7035398
Formula | C17 H13 N O |
Calculated formula | C17 H13 N O |
SMILES | c1(ccc2ccccc2c1/C=N/c1ccccc1)O |
Title of publication | Synthesis of a series of new platinum organometallic complexes derived from bidentate Schiff-base ligands and their catalytic activity in the hydrosilylation and dehydrosilylation of styrene. |
Authors of publication | Lachachi, M. Belhadj; Benabdallah, Tayeb; Aguiar, Pedro M.; Youcef, M. Hadj; Whitwood, Adrian C.; Lynam, Jason M. |
Journal of publication | Dalton transactions (Cambridge, England : 2003) |
Year of publication | 2015 |
Journal volume | 44 |
Journal issue | 26 |
Pages of publication | 11919 - 11928 |
a | 11.9893 ± 0.0002 Å |
b | 14.0266 ± 0.0003 Å |
c | 7.25469 ± 0.00015 Å |
α | 90° |
β | 90.2237 ± 0.0018° |
γ | 90° |
Cell volume | 1220.01 ± 0.04 Å3 |
Cell temperature | 110.05 ± 0.1 K |
Ambient diffraction temperature | 110.05 ± 0.1 K |
Number of distinct elements | 4 |
Space group number | 14 |
Hermann-Mauguin space group symbol | P 1 21/c 1 |
Hall space group symbol | -P 2ybc |
Residual factor for all reflections | 0.0584 |
Residual factor for significantly intense reflections | 0.0464 |
Weighted residual factors for significantly intense reflections | 0.1196 |
Weighted residual factors for all reflections included in the refinement | 0.1285 |
Goodness-of-fit parameter for all reflections included in the refinement | 1.032 |
Diffraction radiation probe | x-ray |
Diffraction radiation wavelength | 0.7107 Å |
Diffraction radiation type | MoKα |