Information card for entry 7035401
Formula | C54.5 H58 N2 O5 Pt2 |
Calculated formula | C54.5 H58 N2 O5 Pt2 |
Title of publication | Synthesis of a series of new platinum organometallic complexes derived from bidentate Schiff-base ligands and their catalytic activity in the hydrosilylation and dehydrosilylation of styrene. |
Authors of publication | Lachachi, M. Belhadj; Benabdallah, Tayeb; Aguiar, Pedro M.; Youcef, M. Hadj; Whitwood, Adrian C.; Lynam, Jason M. |
Journal of publication | Dalton transactions (Cambridge, England : 2003) |
Year of publication | 2015 |
Journal volume | 44 |
Journal issue | 26 |
Pages of publication | 11919 - 11928 |
a | 7.1629 ± 0.0004 Å |
b | 17.1325 ± 0.0007 Å |
c | 19.9614 ± 0.0008 Å |
α | 87.663 ± 0.003° |
β | 84.731 ± 0.004° |
γ | 82.141 ± 0.004° |
Cell volume | 2415.4 ± 0.2 Å3 |
Cell temperature | 110.05 ± 0.1 K |
Ambient diffraction temperature | 110.05 ± 0.1 K |
Number of distinct elements | 5 |
Space group number | 2 |
Hermann-Mauguin space group symbol | P -1 |
Hall space group symbol | -P 1 |
Residual factor for all reflections | 0.0533 |
Residual factor for significantly intense reflections | 0.0353 |
Weighted residual factors for significantly intense reflections | 0.0753 |
Weighted residual factors for all reflections included in the refinement | 0.0812 |
Goodness-of-fit parameter for all reflections included in the refinement | 1.046 |
Diffraction radiation probe | x-ray |
Diffraction radiation wavelength | 0.7107 Å |
Diffraction radiation type | MoKα |