Information card for entry 7035400
Formula | C25 H25 N O2 Pt |
Calculated formula | C25 H25 N O2 Pt |
Title of publication | Synthesis of a series of new platinum organometallic complexes derived from bidentate Schiff-base ligands and their catalytic activity in the hydrosilylation and dehydrosilylation of styrene. |
Authors of publication | Lachachi, M. Belhadj; Benabdallah, Tayeb; Aguiar, Pedro M.; Youcef, M. Hadj; Whitwood, Adrian C.; Lynam, Jason M. |
Journal of publication | Dalton transactions (Cambridge, England : 2003) |
Year of publication | 2015 |
Journal volume | 44 |
Journal issue | 26 |
Pages of publication | 11919 - 11928 |
a | 9.5684 ± 0.0005 Å |
b | 10.2961 ± 0.0005 Å |
c | 12.1674 ± 0.0007 Å |
α | 98.042 ± 0.004° |
β | 112.189 ± 0.005° |
γ | 109.089 ± 0.005° |
Cell volume | 1000.24 ± 0.12 Å3 |
Cell temperature | 110.05 ± 0.1 K |
Ambient diffraction temperature | 110.05 ± 0.1 K |
Number of distinct elements | 5 |
Space group number | 2 |
Hermann-Mauguin space group symbol | P -1 |
Hall space group symbol | -P 1 |
Residual factor for all reflections | 0.0377 |
Residual factor for significantly intense reflections | 0.0326 |
Weighted residual factors for significantly intense reflections | 0.0585 |
Weighted residual factors for all reflections included in the refinement | 0.0601 |
Goodness-of-fit parameter for all reflections included in the refinement | 1.049 |
Diffraction radiation probe | x-ray |
Diffraction radiation wavelength | 0.71073 Å |
Diffraction radiation type | MoKα |