Information card for entry 7035460
Formula | C21 H29 P |
Calculated formula | C21 H29 P |
Title of publication | Alkynyl functionalized Al/P-based frustrated Lewis pairs - aluminium alkynide elimination and evidence for the formation of 3H-phosphaallenes [R-P[double bond, length as m-dash]C[double bond, length as m-dash]C(H)-(t)Bu]. |
Authors of publication | Klöcker, Hans; Roters, Steffi; Hepp, Alexander; Uhl, Werner |
Journal of publication | Dalton transactions (Cambridge, England : 2003) |
Year of publication | 2015 |
Journal volume | 44 |
Journal issue | 28 |
Pages of publication | 12670 - 12679 |
a | 10.175 ± 0.0003 Å |
b | 11.9208 ± 0.0004 Å |
c | 16.3031 ± 0.0005 Å |
α | 90° |
β | 90° |
γ | 90° |
Cell volume | 1977.47 ± 0.11 Å3 |
Cell temperature | 153 ± 2 K |
Ambient diffraction temperature | 153 ± 2 K |
Number of distinct elements | 3 |
Space group number | 19 |
Hermann-Mauguin space group symbol | P 21 21 21 |
Hall space group symbol | P 2ac 2ab |
Residual factor for all reflections | 0.05 |
Residual factor for significantly intense reflections | 0.045 |
Weighted residual factors for significantly intense reflections | 0.1125 |
Weighted residual factors for all reflections included in the refinement | 0.1158 |
Goodness-of-fit parameter for all reflections included in the refinement | 1.055 |
Diffraction radiation wavelength | 0.71073 Å |
Diffraction radiation type | MoKα |