Information card for entry 7035461
Formula | C37 H74 Al P Si4 |
Calculated formula | C36.995 H73.988 Al P Si4 |
Title of publication | Alkynyl functionalized Al/P-based frustrated Lewis pairs - aluminium alkynide elimination and evidence for the formation of 3H-phosphaallenes [R-P[double bond, length as m-dash]C[double bond, length as m-dash]C(H)-(t)Bu]. |
Authors of publication | Klöcker, Hans; Roters, Steffi; Hepp, Alexander; Uhl, Werner |
Journal of publication | Dalton transactions (Cambridge, England : 2003) |
Year of publication | 2015 |
Journal volume | 44 |
Journal issue | 28 |
Pages of publication | 12670 - 12679 |
a | 18.4546 ± 0.0016 Å |
b | 13.0416 ± 0.0011 Å |
c | 20.2605 ± 0.0017 Å |
α | 90° |
β | 111.67 ± 0.002° |
γ | 90° |
Cell volume | 4531.6 ± 0.7 Å3 |
Cell temperature | 153 ± 2 K |
Ambient diffraction temperature | 153 ± 2 K |
Number of distinct elements | 5 |
Space group number | 14 |
Hermann-Mauguin space group symbol | P 1 21/c 1 |
Hall space group symbol | -P 2ybc |
Residual factor for all reflections | 0.0526 |
Residual factor for significantly intense reflections | 0.0433 |
Weighted residual factors for significantly intense reflections | 0.1208 |
Weighted residual factors for all reflections included in the refinement | 0.1291 |
Goodness-of-fit parameter for all reflections included in the refinement | 1.024 |
Diffraction radiation wavelength | 0.71073 Å |
Diffraction radiation type | MoKα |