Information card for entry 7035462
Formula | C30 H19 Eu N6 O10 |
Calculated formula | C30 H18 Eu N6 O10 |
Title of publication | Protonation effect on ligands in EuL: a luminescent switcher for fast naked-eye detection of HCl. |
Authors of publication | Zhang, Jun; Yang, Wen-Bin; Wu, Xiao-Yuan; Kuang, Xiao-Fei; Lu, Can-Zhong |
Journal of publication | Dalton transactions (Cambridge, England : 2003) |
Year of publication | 2015 |
Journal volume | 44 |
Journal issue | 30 |
Pages of publication | 13586 - 13591 |
a | 17.455 ± 0.0011 Å |
b | 17.5918 ± 0.0009 Å |
c | 19.7955 ± 0.0011 Å |
α | 90° |
β | 104.96 ± 0.007° |
γ | 90° |
Cell volume | 5872.5 ± 0.6 Å3 |
Cell temperature | 100 ± 0.13 K |
Ambient diffraction temperature | 100 ± 0.13 K |
Number of distinct elements | 5 |
Space group number | 15 |
Hermann-Mauguin space group symbol | C 1 2/c 1 |
Hall space group symbol | -C 2yc |
Residual factor for all reflections | 0.0593 |
Residual factor for significantly intense reflections | 0.052 |
Weighted residual factors for significantly intense reflections | 0.1453 |
Weighted residual factors for all reflections included in the refinement | 0.1498 |
Goodness-of-fit parameter for all reflections included in the refinement | 1.047 |
Diffraction radiation wavelength | 0.71073 Å |
Diffraction radiation type | MoKα |