Information card for entry 7035465
Formula | C18 H17.8 Co2 N O10.9 |
Calculated formula | C18 H17.8 Co2 N O10.9 |
Title of publication | Solvent-free heterogeneous catalysis for cyanosilylation in a dynamic cobalt-MOF. |
Authors of publication | Cui, Xin; Xu, Mei-Chen; Zhang, Ling-Juan; Yao, Ru-Xin; Zhang, Xian-Ming |
Journal of publication | Dalton transactions (Cambridge, England : 2003) |
Year of publication | 2015 |
Journal volume | 44 |
Journal issue | 28 |
Pages of publication | 12711 - 12716 |
a | 13.582 ± 0.0004 Å |
b | 10.8173 ± 0.0003 Å |
c | 14.7037 ± 0.0005 Å |
α | 90° |
β | 110.628 ± 0.001° |
γ | 90° |
Cell volume | 2021.78 ± 0.11 Å3 |
Cell temperature | 298 ± 2 K |
Ambient diffraction temperature | 298 ± 2 K |
Number of distinct elements | 5 |
Space group number | 14 |
Hermann-Mauguin space group symbol | P 1 21/c 1 |
Hall space group symbol | -P 2ybc |
Residual factor for all reflections | 0.033 |
Residual factor for significantly intense reflections | 0.0299 |
Weighted residual factors for significantly intense reflections | 0.0782 |
Weighted residual factors for all reflections included in the refinement | 0.0809 |
Goodness-of-fit parameter for all reflections included in the refinement | 1.06 |
Diffraction radiation wavelength | 0.71073 Å |
Diffraction radiation type | MoKα |