Information card for entry 7035466
Formula | C17.75 H16.72 Co2 N O10.13 |
Calculated formula | C17.75 H16.71 Co2 N O10.13 |
Title of publication | Solvent-free heterogeneous catalysis for cyanosilylation in a dynamic cobalt-MOF. |
Authors of publication | Cui, Xin; Xu, Mei-Chen; Zhang, Ling-Juan; Yao, Ru-Xin; Zhang, Xian-Ming |
Journal of publication | Dalton transactions (Cambridge, England : 2003) |
Year of publication | 2015 |
Journal volume | 44 |
Journal issue | 28 |
Pages of publication | 12711 - 12716 |
a | 13.5497 ± 0.0007 Å |
b | 10.8567 ± 0.0004 Å |
c | 14.6263 ± 0.0007 Å |
α | 90° |
β | 109.784 ± 0.006° |
γ | 90° |
Cell volume | 2024.6 ± 0.18 Å3 |
Cell temperature | 293 ± 2 K |
Ambient diffraction temperature | 293 ± 2 K |
Number of distinct elements | 5 |
Space group number | 14 |
Hermann-Mauguin space group symbol | P 1 21/c 1 |
Hall space group symbol | -P 2ybc |
Residual factor for all reflections | 0.0767 |
Residual factor for significantly intense reflections | 0.0706 |
Weighted residual factors for significantly intense reflections | 0.1574 |
Weighted residual factors for all reflections included in the refinement | 0.1596 |
Goodness-of-fit parameter for all reflections included in the refinement | 1.293 |
Diffraction radiation wavelength | 0.71073 Å |
Diffraction radiation type | MoKα |