Information card for entry 7035467
Formula | C17.5 H15.5 Co2 N0.75 O9.75 |
Calculated formula | C17.5 H15.5 Co2 N0.75 O9.75 |
Title of publication | Solvent-free heterogeneous catalysis for cyanosilylation in a dynamic cobalt-MOF. |
Authors of publication | Cui, Xin; Xu, Mei-Chen; Zhang, Ling-Juan; Yao, Ru-Xin; Zhang, Xian-Ming |
Journal of publication | Dalton transactions (Cambridge, England : 2003) |
Year of publication | 2015 |
Journal volume | 44 |
Journal issue | 28 |
Pages of publication | 12711 - 12716 |
a | 13.4701 ± 0.0013 Å |
b | 10.8298 ± 0.0006 Å |
c | 14.6883 ± 0.0011 Å |
α | 90° |
β | 109.83 ± 0.01° |
γ | 90° |
Cell volume | 2015.7 ± 0.3 Å3 |
Cell temperature | 293 ± 2 K |
Ambient diffraction temperature | 293 ± 2 K |
Number of distinct elements | 5 |
Space group number | 14 |
Hermann-Mauguin space group symbol | P 1 21/c 1 |
Hall space group symbol | -P 2ybc |
Residual factor for all reflections | 0.079 |
Residual factor for significantly intense reflections | 0.0657 |
Weighted residual factors for significantly intense reflections | 0.1518 |
Weighted residual factors for all reflections included in the refinement | 0.1573 |
Goodness-of-fit parameter for all reflections included in the refinement | 1.264 |
Diffraction radiation wavelength | 0.71073 Å |
Diffraction radiation type | MoKα |