Information card for entry 7035469
Formula | C9 H11 Cu N O10 |
Calculated formula | C9 H11 Cu N O10 |
Title of publication | Five water-soluble zwitterionic copper(ii)-carboxylate polymers: role of dipyridyl coligands in enhancing the DNA-binding, cleaving and anticancer activities. |
Authors of publication | Chen, Ming; Tang, Xiao-Yan; Yang, Shui-Ping; Li, Huan-Huan; Zhao, Hai-Qing; Jiang, Zhi-Hong; Chen, Jin-Xiang; Chen, Wen-Hua |
Journal of publication | Dalton transactions (Cambridge, England : 2003) |
Year of publication | 2015 |
Journal volume | 44 |
Journal issue | 29 |
Pages of publication | 13369 - 13377 |
a | 9.2384 ± 0.0018 Å |
b | 7.4454 ± 0.0015 Å |
c | 23.041 ± 0.006 Å |
α | 90° |
β | 113.23 ± 0.03° |
γ | 90° |
Cell volume | 1456.4 ± 0.6 Å3 |
Cell temperature | 153 ± 2 K |
Ambient diffraction temperature | 153 ± 2 K |
Number of distinct elements | 5 |
Space group number | 14 |
Hermann-Mauguin space group symbol | P 1 21/c 1 |
Hall space group symbol | -P 2ybc |
Residual factor for all reflections | 0.0714 |
Residual factor for significantly intense reflections | 0.056 |
Weighted residual factors for significantly intense reflections | 0.1651 |
Weighted residual factors for all reflections included in the refinement | 0.1748 |
Goodness-of-fit parameter for all reflections included in the refinement | 1.15 |
Diffraction radiation wavelength | 0.71073 Å |
Diffraction radiation type | MoKα |