Information card for entry 7035470
Formula | C19 H19 Cu N3 O9 |
Calculated formula | C19 H19 Cu N3 O9 |
Title of publication | Five water-soluble zwitterionic copper(ii)-carboxylate polymers: role of dipyridyl coligands in enhancing the DNA-binding, cleaving and anticancer activities. |
Authors of publication | Chen, Ming; Tang, Xiao-Yan; Yang, Shui-Ping; Li, Huan-Huan; Zhao, Hai-Qing; Jiang, Zhi-Hong; Chen, Jin-Xiang; Chen, Wen-Hua |
Journal of publication | Dalton transactions (Cambridge, England : 2003) |
Year of publication | 2015 |
Journal volume | 44 |
Journal issue | 29 |
Pages of publication | 13369 - 13377 |
a | 9.1905 ± 0.0005 Å |
b | 7.7875 ± 0.0004 Å |
c | 27.5073 ± 0.0015 Å |
α | 90° |
β | 94.002 ± 0.0008° |
γ | 90° |
Cell volume | 1963.92 ± 0.18 Å3 |
Cell temperature | 296 ± 2 K |
Ambient diffraction temperature | 296 ± 2 K |
Number of distinct elements | 5 |
Space group number | 14 |
Hermann-Mauguin space group symbol | P 1 21/n 1 |
Hall space group symbol | -P 2yn |
Residual factor for all reflections | 0.0398 |
Residual factor for significantly intense reflections | 0.0325 |
Weighted residual factors for significantly intense reflections | 0.0785 |
Weighted residual factors for all reflections included in the refinement | 0.0814 |
Goodness-of-fit parameter for all reflections included in the refinement | 1.062 |
Diffraction radiation wavelength | 0.71073 Å |
Diffraction radiation type | MoKα |