Information card for entry 7035471
Formula | C9 H11 Cu N O9 |
Calculated formula | C9 H11 Cu N O9 |
Title of publication | Five water-soluble zwitterionic copper(ii)-carboxylate polymers: role of dipyridyl coligands in enhancing the DNA-binding, cleaving and anticancer activities. |
Authors of publication | Chen, Ming; Tang, Xiao-Yan; Yang, Shui-Ping; Li, Huan-Huan; Zhao, Hai-Qing; Jiang, Zhi-Hong; Chen, Jin-Xiang; Chen, Wen-Hua |
Journal of publication | Dalton transactions (Cambridge, England : 2003) |
Year of publication | 2015 |
Journal volume | 44 |
Journal issue | 29 |
Pages of publication | 13369 - 13377 |
a | 7.1654 ± 0.0009 Å |
b | 7.6594 ± 0.0009 Å |
c | 11.4555 ± 0.0014 Å |
α | 77.713 ± 0.002° |
β | 75.932 ± 0.002° |
γ | 74.525 ± 0.002° |
Cell volume | 580.34 ± 0.12 Å3 |
Cell temperature | 296 ± 2 K |
Ambient diffraction temperature | 296 ± 2 K |
Number of distinct elements | 5 |
Space group number | 2 |
Hermann-Mauguin space group symbol | P -1 |
Hall space group symbol | -P 1 |
Residual factor for all reflections | 0.0341 |
Residual factor for significantly intense reflections | 0.0326 |
Weighted residual factors for significantly intense reflections | 0.0863 |
Weighted residual factors for all reflections included in the refinement | 0.0876 |
Goodness-of-fit parameter for all reflections included in the refinement | 1.081 |
Diffraction radiation wavelength | 0.71073 Å |
Diffraction radiation type | MoKα |