Information card for entry 7035481
Formula | C35 H25 N O P Pd |
Calculated formula | C35 H26 N O P Pd |
SMILES | [Pd]12(c3cccc4c3c([N]1=Cc1c(cccc1)O2)ccc4)[P](c1ccccc1)(c1ccccc1)c1ccccc1 |
Title of publication | Palladium(0)-mediated C-H bond activation of N-(naphthyl)salicylaldimine and related ligands: utilization of the resulting organopalladium complexes in catalytic C-C and C-N coupling reactions. |
Authors of publication | Dutta, Jayita; Richmond, Michael G.; Bhattacharya, Samaresh |
Journal of publication | Dalton transactions (Cambridge, England : 2003) |
Year of publication | 2015 |
Journal volume | 44 |
Journal issue | 30 |
Pages of publication | 13615 - 13632 |
a | 14.3819 ± 0.0011 Å |
b | 11.8875 ± 0.0009 Å |
c | 17.6698 ± 0.0013 Å |
α | 90° |
β | 112.09 ± 0.004° |
γ | 90° |
Cell volume | 2799.2 ± 0.4 Å3 |
Cell temperature | 293 ± 2 K |
Ambient diffraction temperature | 293 ± 2 K |
Number of distinct elements | 6 |
Space group number | 14 |
Hermann-Mauguin space group symbol | P 1 21/c 1 |
Hall space group symbol | -P 2ybc |
Residual factor for all reflections | 0.1253 |
Residual factor for significantly intense reflections | 0.063 |
Weighted residual factors for significantly intense reflections | 0.1418 |
Weighted residual factors for all reflections included in the refinement | 0.1772 |
Goodness-of-fit parameter for all reflections included in the refinement | 1.016 |
Diffraction radiation wavelength | 0.71073 Å |
Diffraction radiation type | MoKα |