Information card for entry 7035482
Formula | C35 H27 Cl N O P Pd |
Calculated formula | C35 H25 Cl N O P Pd |
SMILES | [Pd]12(c3cccc4cccc([N]2=Cc2c(ccc(c2)Cl)O1)c34)[P](c1ccccc1)(c1ccccc1)c1ccccc1 |
Title of publication | Palladium(0)-mediated C-H bond activation of N-(naphthyl)salicylaldimine and related ligands: utilization of the resulting organopalladium complexes in catalytic C-C and C-N coupling reactions. |
Authors of publication | Dutta, Jayita; Richmond, Michael G.; Bhattacharya, Samaresh |
Journal of publication | Dalton transactions (Cambridge, England : 2003) |
Year of publication | 2015 |
Journal volume | 44 |
Journal issue | 30 |
Pages of publication | 13615 - 13632 |
a | 15.1395 ± 0.0005 Å |
b | 11.782 ± 0.0004 Å |
c | 17.5381 ± 0.0006 Å |
α | 90° |
β | 115.068 ± 0.002° |
γ | 90° |
Cell volume | 2833.66 ± 0.17 Å3 |
Cell temperature | 273 ± 2 K |
Ambient diffraction temperature | 273 ± 2 K |
Number of distinct elements | 7 |
Space group number | 14 |
Hermann-Mauguin space group symbol | P 1 21/c 1 |
Hall space group symbol | -P 2ybc |
Residual factor for all reflections | 0.0466 |
Residual factor for significantly intense reflections | 0.0327 |
Weighted residual factors for significantly intense reflections | 0.0802 |
Weighted residual factors for all reflections included in the refinement | 0.0852 |
Goodness-of-fit parameter for all reflections included in the refinement | 1.086 |
Diffraction radiation wavelength | 0.71073 Å |
Diffraction radiation type | MoKα |