Information card for entry 7035543
Formula | C34 H26 Ho N5 O17 |
Calculated formula | C34 H26 Ho N5 O17 |
Title of publication | A 1D anionic lanthanide coordination polymer as an adsorbent material for the selective uptake of cationic dyes from aqueous solutions. |
Authors of publication | Du, Pei-Yao; Li, Hui; Fu, Xin; Gu, Wen; Liu, Xin |
Journal of publication | Dalton transactions (Cambridge, England : 2003) |
Year of publication | 2015 |
Journal volume | 44 |
Journal issue | 30 |
Pages of publication | 13752 - 13759 |
a | 7.6609 ± 0.0015 Å |
b | 21.518 ± 0.004 Å |
c | 12.258 ± 0.003 Å |
α | 90° |
β | 98.82 ± 0.03° |
γ | 90° |
Cell volume | 1996.8 ± 0.7 Å3 |
Cell temperature | 293 ± 2 K |
Ambient diffraction temperature | 293 ± 2 K |
Number of distinct elements | 5 |
Space group number | 11 |
Hermann-Mauguin space group symbol | P 1 21/m 1 |
Hall space group symbol | -P 2yb |
Residual factor for all reflections | 0.0779 |
Residual factor for significantly intense reflections | 0.0734 |
Weighted residual factors for significantly intense reflections | 0.1947 |
Weighted residual factors for all reflections included in the refinement | 0.2019 |
Goodness-of-fit parameter for all reflections included in the refinement | 1.018 |
Diffraction radiation wavelength | 0.71073 Å |
Diffraction radiation type | MoKα |