Information card for entry 7035544
Formula | C32 H67 Mg N3 Si4 |
Calculated formula | C32 H67 Mg N3 Si4 |
SMILES | C1(C(CC(C)(C)N1c1c(cccc1C(C)C)C(C)C)(C)C)=[Mg](N([Si](C)(C)C)[Si](C)(C)C)N([Si](C)(C)C)[Si](C)(C)C |
Title of publication | Group 1 and 2 cyclic (alkyl)(amino)carbene complexes. |
Authors of publication | Turner, Zoë R; Buffet, Jean-Charles |
Journal of publication | Dalton transactions (Cambridge, England : 2003) |
Year of publication | 2015 |
Journal volume | 44 |
Journal issue | 29 |
Pages of publication | 12985 - 12989 |
a | 12.569 ± 0.0001 Å |
b | 24.6401 ± 0.0002 Å |
c | 13.4387 ± 0.0001 Å |
α | 90° |
β | 106.479 ± 0.001° |
γ | 90° |
Cell volume | 3991.03 ± 0.06 Å3 |
Cell temperature | 150 ± 2 K |
Ambient diffraction temperature | 150 ± 2 K |
Number of distinct elements | 5 |
Space group number | 14 |
Hermann-Mauguin space group symbol | P 1 21/n 1 |
Hall space group symbol | -P 2yn |
Residual factor for all reflections | 0.037 |
Residual factor for significantly intense reflections | 0.0327 |
Weighted residual factors for significantly intense reflections | 0.0856 |
Weighted residual factors for all reflections included in the refinement | 0.089 |
Goodness-of-fit parameter for all reflections included in the refinement | 1.048 |
Diffraction radiation wavelength | 1.54184 Å |
Diffraction radiation type | CuKα |