Information card for entry 7035584
Formula | C36 H54 B2 N O2 P2 S Si Yb |
Calculated formula | C36 H54 B2 N O2 P2 S Si Yb |
Title of publication | Alkynyl-functionalized gold NHC complexes and their coinage metal clusters. |
Authors of publication | Kiefer, Claude; Bestgen, Sebastian; Gamer, Michael T.; Lebedkin, Sergei; Kappes, Manfred M.; Roesky, Peter W. |
Journal of publication | Dalton transactions (Cambridge, England : 2003) |
Year of publication | 2015 |
Journal volume | 44 |
Journal issue | 30 |
Pages of publication | 13662 - 13670 |
a | 9.8319 ± 0.0002 Å |
b | 11.594 ± 0.0003 Å |
c | 35.947 ± 0.0009 Å |
α | 90° |
β | 97.227 ± 0.002° |
γ | 90° |
Cell volume | 4065.08 ± 0.17 Å3 |
Cell temperature | 150 K |
Ambient diffraction temperature | 150 K |
Number of distinct elements | 9 |
Space group number | 14 |
Hermann-Mauguin space group symbol | P 1 21/n 1 |
Hall space group symbol | -P 2yn |
Residual factor for all reflections | 0.0411 |
Residual factor for significantly intense reflections | 0.0278 |
Weighted residual factors for significantly intense reflections | 0.0595 |
Weighted residual factors for all reflections included in the refinement | 0.0624 |
Goodness-of-fit parameter for all reflections included in the refinement | 0.916 |
Diffraction radiation wavelength | 0.71073 Å |
Diffraction radiation type | MoKα |