Information card for entry 7035585
Formula | C36 H54 B2 Lu N O2 P2 S Si |
Calculated formula | C36 H54 B2 Lu N O2 P2 S Si |
Title of publication | Alkynyl-functionalized gold NHC complexes and their coinage metal clusters. |
Authors of publication | Kiefer, Claude; Bestgen, Sebastian; Gamer, Michael T.; Lebedkin, Sergei; Kappes, Manfred M.; Roesky, Peter W. |
Journal of publication | Dalton transactions (Cambridge, England : 2003) |
Year of publication | 2015 |
Journal volume | 44 |
Journal issue | 30 |
Pages of publication | 13662 - 13670 |
a | 9.7913 ± 0.0004 Å |
b | 11.4667 ± 0.0004 Å |
c | 35.8275 ± 0.0019 Å |
α | 90° |
β | 97.003 ± 0.004° |
γ | 90° |
Cell volume | 3992.5 ± 0.3 Å3 |
Cell temperature | 150 K |
Ambient diffraction temperature | 150 K |
Number of distinct elements | 9 |
Space group number | 14 |
Hermann-Mauguin space group symbol | P 1 21/n 1 |
Hall space group symbol | -P 2yn |
Residual factor for all reflections | 0.1125 |
Residual factor for significantly intense reflections | 0.0652 |
Weighted residual factors for significantly intense reflections | 0.1283 |
Weighted residual factors for all reflections included in the refinement | 0.1441 |
Goodness-of-fit parameter for all reflections included in the refinement | 1.015 |
Diffraction radiation wavelength | 0.71073 Å |
Diffraction radiation type | MoKα |