Information card for entry 7035595
Formula | C36 H36 Cl5 F3 Fe P2 Pt |
Calculated formula | C36 H36 Cl5 F3 Fe P2 Pt |
SMILES | [Pt]1(Cl)(Cl)[P@@]([c]23[Fe]456789%10([c]2([cH]6[cH]5[cH]34)[C@H]([P]1(c1cc(C)cc(C)c1)c1cc(C)cc(C)c1)C)[cH]1[cH]7[cH]8[cH]9[cH]%101)(C(F)(F)F)c1ccccc1.ClC(Cl)Cl |
Title of publication | P-Trifluoromethyl ligands derived from Josiphos in the Ir-catalysed hydrogenation of 3,4-dihydroisoquinoline hydrochlorides. |
Authors of publication | Schwenk, R.; Togni, A. |
Journal of publication | Dalton transactions (Cambridge, England : 2003) |
Year of publication | 2015 |
Journal volume | 44 |
Journal issue | 45 |
Pages of publication | 19566 - 19575 |
a | 13.244 ± 0.0013 Å |
b | 15.1859 ± 0.0015 Å |
c | 19.438 ± 0.0019 Å |
α | 90° |
β | 90° |
γ | 90° |
Cell volume | 3909.4 ± 0.7 Å3 |
Cell temperature | 100 ± 2 K |
Ambient diffraction temperature | 100 ± 2 K |
Number of distinct elements | 7 |
Space group number | 19 |
Hermann-Mauguin space group symbol | P 21 21 21 |
Hall space group symbol | P 2ac 2ab |
Residual factor for all reflections | 0.0407 |
Residual factor for significantly intense reflections | 0.0336 |
Weighted residual factors for significantly intense reflections | 0.0756 |
Weighted residual factors for all reflections included in the refinement | 0.0785 |
Goodness-of-fit parameter for all reflections included in the refinement | 1.039 |
Diffraction radiation wavelength | 0.71073 Å |
Diffraction radiation type | MoKα |