Information card for entry 7035596
Formula | C26 H20 Cl2 Co N4 S2 |
Calculated formula | C26 H20 Cl2 Co N4 S2 |
Title of publication | Synthesis, structure and properties of [Co(NCS)2(4-(4-chlorobenzyl)pyridine)2]n, that shows slow magnetic relaxations and a metamagnetic transition. |
Authors of publication | Werner, Julia; Tomkowicz, Zbigniew; Rams, Michał; Ebbinghaus, Stefan G.; Neumann, Tristan; Näther, Christian |
Journal of publication | Dalton transactions (Cambridge, England : 2003) |
Year of publication | 2015 |
Journal volume | 44 |
Journal issue | 31 |
Pages of publication | 14149 - 14158 |
a | 9.0456 ± 0.0004 Å |
b | 10.8405 ± 0.0005 Å |
c | 14.9413 ± 0.0006 Å |
α | 73.393 ± 0.003° |
β | 83.369 ± 0.004° |
γ | 68.356 ± 0.003° |
Cell volume | 1304.94 ± 0.1 Å3 |
Cell temperature | 200 ± 2 K |
Ambient diffraction temperature | 200 ± 2 K |
Number of distinct elements | 6 |
Space group number | 2 |
Hermann-Mauguin space group symbol | P -1 |
Hall space group symbol | -P 1 |
Residual factor for all reflections | 0.0635 |
Residual factor for significantly intense reflections | 0.0441 |
Weighted residual factors for significantly intense reflections | 0.0941 |
Weighted residual factors for all reflections included in the refinement | 0.102 |
Goodness-of-fit parameter for all reflections included in the refinement | 1.034 |
Diffraction radiation wavelength | 0.71073 Å |
Diffraction radiation type | MoKα |