Information card for entry 7035616
Formula | C3 H10 Mn N O7 P |
Calculated formula | C3 H10 Mn N O7 P |
Title of publication | Solvent-free synthesis of new metal phosphate-oxalates: influence of different metal ions on the framework structures. |
Authors of publication | Luan, Lindong; Yang, Meng; Bian, Yixuan; Lin, Zhien; Huang, Hui |
Journal of publication | Dalton transactions (Cambridge, England : 2003) |
Year of publication | 2015 |
Journal volume | 44 |
Journal issue | 30 |
Pages of publication | 13485 - 13489 |
a | 5.56671 ± 0.00011 Å |
b | 15.6297 ± 0.0003 Å |
c | 9.54079 ± 0.00018 Å |
α | 90° |
β | 91.8039 ± 0.0017° |
γ | 90° |
Cell volume | 829.69 ± 0.03 Å3 |
Cell temperature | 293 K |
Ambient diffraction temperature | 293 K |
Number of distinct elements | 6 |
Space group number | 14 |
Hermann-Mauguin space group symbol | P 1 21/n 1 |
Hall space group symbol | -P 2yn |
Residual factor for all reflections | 0.0451 |
Residual factor for significantly intense reflections | 0.0436 |
Weighted residual factors for significantly intense reflections | 0.1129 |
Weighted residual factors for all reflections included in the refinement | 0.115 |
Goodness-of-fit parameter for all reflections included in the refinement | 1.035 |
Diffraction radiation probe | x-ray |
Diffraction radiation wavelength | 1.54184 Å |
Diffraction radiation type | CuKα |