Information card for entry 7035617
Formula | C3 H10 Cd N O7 P |
Calculated formula | C3 H10 Cd N O7 P |
Title of publication | Solvent-free synthesis of new metal phosphate-oxalates: influence of different metal ions on the framework structures. |
Authors of publication | Luan, Lindong; Yang, Meng; Bian, Yixuan; Lin, Zhien; Huang, Hui |
Journal of publication | Dalton transactions (Cambridge, England : 2003) |
Year of publication | 2015 |
Journal volume | 44 |
Journal issue | 30 |
Pages of publication | 13485 - 13489 |
a | 5.63389 ± 0.0001 Å |
b | 15.9428 ± 0.0002 Å |
c | 9.61828 ± 0.00015 Å |
α | 90° |
β | 91.1156 ± 0.0015° |
γ | 90° |
Cell volume | 863.75 ± 0.02 Å3 |
Cell temperature | 293 K |
Ambient diffraction temperature | 293 K |
Number of distinct elements | 6 |
Space group number | 14 |
Hermann-Mauguin space group symbol | P 1 21/n 1 |
Hall space group symbol | -P 2yn |
Residual factor for all reflections | 0.0405 |
Residual factor for significantly intense reflections | 0.0395 |
Weighted residual factors for significantly intense reflections | 0.1032 |
Weighted residual factors for all reflections included in the refinement | 0.1046 |
Goodness-of-fit parameter for all reflections included in the refinement | 1.12 |
Diffraction radiation probe | x-ray |
Diffraction radiation wavelength | 1.54184 Å |
Diffraction radiation type | CuKα |