Information card for entry 7035620
Formula | C73 H50 Cu7 N31 O |
Calculated formula | C73 H48 Cu7 N31 O |
Title of publication | A homochiral Cu(i) coordination polymer based on achiral precursors and its photocatalytic properties. |
Authors of publication | He, Xiang; Fang, Kang; Guo, Xiao-Hai; Han, Jing; Lu, Xiao-Peng; Li, Ming-Xing |
Journal of publication | Dalton transactions (Cambridge, England : 2003) |
Year of publication | 2015 |
Journal volume | 44 |
Journal issue | 30 |
Pages of publication | 13545 - 13549 |
a | 18.775 ± 0.003 Å |
b | 15.626 ± 0.003 Å |
c | 12.872 ± 0.002 Å |
α | 90° |
β | 99.973 ± 0.002° |
γ | 90° |
Cell volume | 3719.3 ± 1.1 Å3 |
Cell temperature | 296 ± 2 K |
Ambient diffraction temperature | 296 ± 2 K |
Number of distinct elements | 5 |
Space group number | 5 |
Hermann-Mauguin space group symbol | C 1 2 1 |
Hall space group symbol | C 2y |
Residual factor for all reflections | 0.1017 |
Residual factor for significantly intense reflections | 0.0562 |
Weighted residual factors for significantly intense reflections | 0.1013 |
Weighted residual factors for all reflections included in the refinement | 0.1158 |
Goodness-of-fit parameter for all reflections included in the refinement | 0.968 |
Diffraction radiation wavelength | 0.71073 Å |
Diffraction radiation type | MoKα |