Information card for entry 7035619
Formula | C3 H10 In N O10 P2 |
Calculated formula | C3 H10 In N O10 P2 |
Title of publication | Solvent-free synthesis of new metal phosphate-oxalates: influence of different metal ions on the framework structures. |
Authors of publication | Luan, Lindong; Yang, Meng; Bian, Yixuan; Lin, Zhien; Huang, Hui |
Journal of publication | Dalton transactions (Cambridge, England : 2003) |
Year of publication | 2015 |
Journal volume | 44 |
Journal issue | 30 |
Pages of publication | 13485 - 13489 |
a | 7.6595 ± 0.0006 Å |
b | 8.455 ± 0.0004 Å |
c | 9.6469 ± 0.0006 Å |
α | 91.768 ± 0.005° |
β | 111.205 ± 0.006° |
γ | 115.495 ± 0.006° |
Cell volume | 512.65 ± 0.07 Å3 |
Cell temperature | 293 K |
Ambient diffraction temperature | 293 K |
Number of distinct elements | 6 |
Space group number | 2 |
Hermann-Mauguin space group symbol | P -1 |
Hall space group symbol | -P 1 |
Residual factor for all reflections | 0.0246 |
Residual factor for significantly intense reflections | 0.0232 |
Weighted residual factors for significantly intense reflections | 0.0584 |
Weighted residual factors for all reflections included in the refinement | 0.0593 |
Goodness-of-fit parameter for all reflections included in the refinement | 1.101 |
Diffraction radiation probe | x-ray |
Diffraction radiation wavelength | 0.71073 Å |
Diffraction radiation type | MoKα |