Information card for entry 7035663
Formula | C69 H108 Cl3 Cr N6 O12 |
Calculated formula | C69 H108 Cl3 Cr N6 O12 |
Title of publication | Switching-on luminescence in anilate-based molecular materials. |
Authors of publication | Atzori, Matteo; Artizzu, Flavia; Marchiò, Luciano; Loche, Danilo; Caneschi, Andrea; Serpe, Angela; Deplano, Paola; Avarvari, Narcis; Mercuri, Maria Laura |
Journal of publication | Dalton transactions (Cambridge, England : 2003) |
Year of publication | 2015 |
Journal volume | 44 |
Journal issue | 36 |
Pages of publication | 15786 - 15802 |
a | 20.219 ± 0.0018 Å |
b | 13.162 ± 0.003 Å |
c | 29.914 ± 0.005 Å |
α | 90° |
β | 108.729 ± 0.01° |
γ | 90° |
Cell volume | 7539 ± 2 Å3 |
Cell temperature | 150 ± 2 K |
Ambient diffraction temperature | 150 ± 2 K |
Number of distinct elements | 6 |
Space group number | 14 |
Hermann-Mauguin space group symbol | P 1 21/a 1 |
Hall space group symbol | -P 2yab |
Residual factor for all reflections | 0.1342 |
Residual factor for significantly intense reflections | 0.0901 |
Weighted residual factors for significantly intense reflections | 0.2062 |
Weighted residual factors for all reflections included in the refinement | 0.2278 |
Goodness-of-fit parameter for all reflections included in the refinement | 1.076 |
Diffraction radiation wavelength | 0.71073 Å |
Diffraction radiation type | MoKα |