Information card for entry 7035664
Formula | C55 H44 Cl N O6 P2 |
Calculated formula | C55 H44 Cl N O6 P2 |
Title of publication | Switching-on luminescence in anilate-based molecular materials. |
Authors of publication | Atzori, Matteo; Artizzu, Flavia; Marchiò, Luciano; Loche, Danilo; Caneschi, Andrea; Serpe, Angela; Deplano, Paola; Avarvari, Narcis; Mercuri, Maria Laura |
Journal of publication | Dalton transactions (Cambridge, England : 2003) |
Year of publication | 2015 |
Journal volume | 44 |
Journal issue | 36 |
Pages of publication | 15786 - 15802 |
a | 9.9874 ± 0.0005 Å |
b | 11.0867 ± 0.0011 Å |
c | 12.2489 ± 0.0009 Å |
α | 88.863 ± 0.008° |
β | 68.55 ± 0.006° |
γ | 66.46 ± 0.007° |
Cell volume | 1144.57 ± 0.18 Å3 |
Cell temperature | 293 ± 2 K |
Ambient diffraction temperature | 293 ± 2 K |
Number of distinct elements | 6 |
Space group number | 2 |
Hermann-Mauguin space group symbol | P -1 |
Hall space group symbol | -P 1 |
Residual factor for all reflections | 0.1327 |
Residual factor for significantly intense reflections | 0.0583 |
Weighted residual factors for significantly intense reflections | 0.1283 |
Weighted residual factors for all reflections included in the refinement | 0.1527 |
Goodness-of-fit parameter for all reflections included in the refinement | 1.022 |
Diffraction radiation wavelength | 0.71073 Å |
Diffraction radiation type | MoKα |