Information card for entry 7035687
Formula | C27 H17 Gd N2 O7 |
Calculated formula | C27 H17 Gd N2 O7 |
Title of publication | Magnetic and luminescent properties of lanthanide coordination polymers with asymmetric biphenyl-3,2',5'-tricarboxylate. |
Authors of publication | Zhao, Jie; Zhu, Guan-Hong; Xie, Li-Qiong; Wu, Ye-Si; Wu, Hai-Lun; Zhou, Ai-Ju; Wu, Zun-Yuan; Wang, Jing; Chen, Yan-Cong; Tong, Ming-Liang |
Journal of publication | Dalton transactions (Cambridge, England : 2003) |
Year of publication | 2015 |
Journal volume | 44 |
Journal issue | 32 |
Pages of publication | 14424 - 14435 |
a | 26.5096 ± 0.0014 Å |
b | 7.9323 ± 0.0005 Å |
c | 23.0546 ± 0.0012 Å |
α | 90° |
β | 107.419 ± 0.003° |
γ | 90° |
Cell volume | 4625.6 ± 0.5 Å3 |
Cell temperature | 296 ± 2 K |
Ambient diffraction temperature | 296 ± 2 K |
Number of distinct elements | 5 |
Space group number | 15 |
Hermann-Mauguin space group symbol | C 1 2/c 1 |
Hall space group symbol | -C 2yc |
Residual factor for all reflections | 0.0566 |
Residual factor for significantly intense reflections | 0.0335 |
Weighted residual factors for significantly intense reflections | 0.057 |
Weighted residual factors for all reflections included in the refinement | 0.0631 |
Goodness-of-fit parameter for all reflections included in the refinement | 1.008 |
Diffraction radiation wavelength | 0.71073 Å |
Diffraction radiation type | MoKα |