Information card for entry 7035688
Formula | C30 H44 N4 O8 P2 S4 Zn |
Calculated formula | C30 H44 N4 O8 P2 S4 Zn |
Title of publication | Metal ion influences distortion of the ligand in the structure of [M{2-MeO(O)CC6H4NHC(S)NP(S)(OiPr)2}2] (M = Zn(II), Cd(II)) complexes: a driving force for intermolecular aggregation. |
Authors of publication | Safin, Damir A.; Babashkina, Maria G.; Bolte, Michael; Mitoraj, Mariusz P.; Klein, Axel |
Journal of publication | Dalton transactions (Cambridge, England : 2003) |
Year of publication | 2015 |
Journal volume | 44 |
Journal issue | 31 |
Pages of publication | 14101 - 14109 |
a | 10.428 ± 0.0005 Å |
b | 11.4053 ± 0.0006 Å |
c | 17.353 ± 0.0009 Å |
α | 78.001 ± 0.004° |
β | 84.932 ± 0.004° |
γ | 85.131 ± 0.004° |
Cell volume | 2006.19 ± 0.18 Å3 |
Cell temperature | 173 ± 2 K |
Ambient diffraction temperature | 173 ± 2 K |
Number of distinct elements | 7 |
Space group number | 2 |
Hermann-Mauguin space group symbol | P -1 |
Hall space group symbol | -P 1 |
Residual factor for all reflections | 0.0454 |
Residual factor for significantly intense reflections | 0.0384 |
Weighted residual factors for significantly intense reflections | 0.1027 |
Weighted residual factors for all reflections included in the refinement | 0.1055 |
Goodness-of-fit parameter for all reflections included in the refinement | 1.203 |
Diffraction radiation wavelength | 0.71073 Å |
Diffraction radiation type | MoKα |