Information card for entry 7035700
Formula | C18 H24 N2 P2 S2 |
Calculated formula | C18 H24 N2 P2 S2 |
Title of publication | Synthesis and structures of [S[double bond, length as m-dash](H)P(μ-NR)]2, potential building blocks for inorganic phosphorus-sulfur macrocycles. |
Authors of publication | Benson, Callum G. M.; Vasilenko, Vladislav; García-Rodríguez, Raúl; Bond, Andrew D.; González Calera, Silvia; Gade, Lutz H.; Wright, Dominic S. |
Journal of publication | Dalton transactions (Cambridge, England : 2003) |
Year of publication | 2015 |
Journal volume | 44 |
Journal issue | 32 |
Pages of publication | 14242 - 14247 |
a | 10.4215 ± 0.0003 Å |
b | 11.0475 ± 0.0003 Å |
c | 9.3492 ± 0.0003 Å |
α | 90° |
β | 109.462 ± 0.002° |
γ | 90° |
Cell volume | 1014.89 ± 0.05 Å3 |
Cell temperature | 180 ± 2 K |
Ambient diffraction temperature | 180 ± 2 K |
Number of distinct elements | 5 |
Space group number | 14 |
Hermann-Mauguin space group symbol | P 1 21/c 1 |
Hall space group symbol | -P 2ybc |
Residual factor for all reflections | 0.0647 |
Residual factor for significantly intense reflections | 0.0456 |
Weighted residual factors for significantly intense reflections | 0.0941 |
Weighted residual factors for all reflections included in the refinement | 0.1095 |
Goodness-of-fit parameter for all reflections included in the refinement | 1.048 |
Diffraction radiation wavelength | 1.54178 Å |
Diffraction radiation type | CuKα |