Information card for entry 7035711
Formula | C24 H23 Fe O2 P S |
Calculated formula | C24 H23 Fe O2 P S |
SMILES | [Fe]12345678([c]9([cH]1[cH]2[cH]3[cH]49)CS(=O)(=O)C)[c]1([cH]8[cH]7[cH]6[cH]51)P(c1ccccc1)c1ccccc1 |
Title of publication | Ferrocenylmethylation reactions with a phosphinoferrocene betaine. |
Authors of publication | Zábranský, Martin; Císařová, Ivana; Štěpnička, Petr |
Journal of publication | Dalton transactions (Cambridge, England : 2003) |
Year of publication | 2015 |
Journal volume | 44 |
Journal issue | 32 |
Pages of publication | 14494 - 14506 |
a | 7.8229 ± 0.0004 Å |
b | 11.1181 ± 0.0005 Å |
c | 12.0934 ± 0.0006 Å |
α | 101.649 ± 0.002° |
β | 94.256 ± 0.002° |
γ | 90.378 ± 0.002° |
Cell volume | 1027.08 ± 0.09 Å3 |
Cell temperature | 150 ± 2 K |
Ambient diffraction temperature | 150 ± 2 K |
Number of distinct elements | 6 |
Space group number | 2 |
Hermann-Mauguin space group symbol | P -1 |
Hall space group symbol | -P 1 |
Residual factor for all reflections | 0.0291 |
Residual factor for significantly intense reflections | 0.025 |
Weighted residual factors for significantly intense reflections | 0.063 |
Weighted residual factors for all reflections included in the refinement | 0.0652 |
Goodness-of-fit parameter for all reflections included in the refinement | 1.043 |
Diffraction radiation wavelength | 0.71073 Å |
Diffraction radiation type | MoKα |