Information card for entry 7035712
Formula | C24 H23 Fe O2 P S |
Calculated formula | C24 H23 Fe O2 P S |
SMILES | [Fe]12345678([c]9([cH]4[cH]3[cH]2[cH]19)CS(=O)(=O)C)[c]1([cH]5[cH]6[cH]7[cH]81)P(c1ccccc1)c1ccccc1 |
Title of publication | Ferrocenylmethylation reactions with a phosphinoferrocene betaine. |
Authors of publication | Zábranský, Martin; Císařová, Ivana; Štěpnička, Petr |
Journal of publication | Dalton transactions (Cambridge, England : 2003) |
Year of publication | 2015 |
Journal volume | 44 |
Journal issue | 32 |
Pages of publication | 14494 - 14506 |
a | 14.1802 ± 0.0009 Å |
b | 9.4057 ± 0.0005 Å |
c | 15.8036 ± 0.001 Å |
α | 90° |
β | 90.557 ± 0.003° |
γ | 90° |
Cell volume | 2107.7 ± 0.2 Å3 |
Cell temperature | 150 ± 2 K |
Ambient diffraction temperature | 150 ± 2 K |
Number of distinct elements | 6 |
Space group number | 14 |
Hermann-Mauguin space group symbol | P 1 21/c 1 |
Hall space group symbol | -P 2ybc |
Residual factor for all reflections | 0.0461 |
Residual factor for significantly intense reflections | 0.0331 |
Weighted residual factors for significantly intense reflections | 0.0722 |
Weighted residual factors for all reflections included in the refinement | 0.0784 |
Goodness-of-fit parameter for all reflections included in the refinement | 1.019 |
Diffraction radiation wavelength | 0.71073 Å |
Diffraction radiation type | MoKα |