Information card for entry 7035721
Formula | C44 H43 Cl Fe2 N6 O9 |
Calculated formula | C44 H43 Cl Fe2 N6 O9 |
Title of publication | Catalytic dioxygenation of flavonol by M(II)-complexes (M = Mn, Fe, Co, Ni, Cu and Zn) - mimicking the M(II)-substituted quercetin 2,3-dioxygenase. |
Authors of publication | Sun, Ying-Ji; Huang, Qian-Qian; Li, Pei; Zhang, Jian-Jun |
Journal of publication | Dalton transactions (Cambridge, England : 2003) |
Year of publication | 2015 |
Journal volume | 44 |
Journal issue | 31 |
Pages of publication | 13926 - 13938 |
a | 16.545 ± 0.005 Å |
b | 16.545 ± 0.005 Å |
c | 36.72 ± 0.02 Å |
α | 90° |
β | 90° |
γ | 90° |
Cell volume | 10052 ± 7 Å3 |
Cell temperature | 296 ± 2 K |
Ambient diffraction temperature | 296 ± 2 K |
Number of distinct elements | 6 |
Space group number | 110 |
Hermann-Mauguin space group symbol | I 41 c d |
Hall space group symbol | I 4bw -2c |
Residual factor for all reflections | 0.1036 |
Residual factor for significantly intense reflections | 0.0757 |
Weighted residual factors for significantly intense reflections | 0.1976 |
Weighted residual factors for all reflections included in the refinement | 0.215 |
Goodness-of-fit parameter for all reflections included in the refinement | 0.995 |
Diffraction radiation wavelength | 0.71073 Å |
Diffraction radiation type | MoKα |