Information card for entry 7035722
Formula | C42 H40 Cl2 Co2 N6 O6 |
Calculated formula | C42 H40 Cl2 Co2 N6 O6 |
SMILES | C1c2cccc[n]2[Co]234([N]1(Cc1cccc[n]21)Cc1cc(OC)ccc1C(O3)=[O][Co]123([N](Cc5cccc[n]15)(Cc1cccc[n]21)Cc1cc(OC)ccc1C(O3)=[O]4)Cl)Cl |
Title of publication | Catalytic dioxygenation of flavonol by M(II)-complexes (M = Mn, Fe, Co, Ni, Cu and Zn) - mimicking the M(II)-substituted quercetin 2,3-dioxygenase. |
Authors of publication | Sun, Ying-Ji; Huang, Qian-Qian; Li, Pei; Zhang, Jian-Jun |
Journal of publication | Dalton transactions (Cambridge, England : 2003) |
Year of publication | 2015 |
Journal volume | 44 |
Journal issue | 31 |
Pages of publication | 13926 - 13938 |
a | 8.726 ± 0.005 Å |
b | 20.348 ± 0.011 Å |
c | 12.677 ± 0.007 Å |
α | 90° |
β | 96.148 ± 0.01° |
γ | 90° |
Cell volume | 2238 ± 2 Å3 |
Cell temperature | 296 ± 2 K |
Ambient diffraction temperature | 296 ± 2 K |
Number of distinct elements | 6 |
Space group number | 14 |
Hermann-Mauguin space group symbol | P 1 21/n 1 |
Hall space group symbol | -P 2yn |
Residual factor for all reflections | 0.0534 |
Residual factor for significantly intense reflections | 0.0369 |
Weighted residual factors for significantly intense reflections | 0.0762 |
Weighted residual factors for all reflections included in the refinement | 0.0808 |
Goodness-of-fit parameter for all reflections included in the refinement | 1.001 |
Diffraction radiation wavelength | 0.71073 Å |
Diffraction radiation type | MoKα |