Information card for entry 7037605
Formula | C58 H88 Mn2 N4 |
Calculated formula | C58 H88 Mn2 N4 |
Title of publication | Stabilisation of carbonyl free amidinato-manganese(ii) hydride complexes: "masked" sources of manganese(i) in organometallic synthesis. |
Authors of publication | Fohlmeister, Lea; Jones, Cameron |
Journal of publication | Dalton transactions (Cambridge, England : 2003) |
Year of publication | 2016 |
Journal volume | 45 |
Journal issue | 4 |
Pages of publication | 1436 - 1442 |
a | 10.3891 ± 0.0004 Å |
b | 10.6635 ± 0.0004 Å |
c | 14.1219 ± 0.0006 Å |
α | 108.98 ± 0.003° |
β | 102.353 ± 0.003° |
γ | 105.95 ± 0.003° |
Cell volume | 1340.99 ± 0.11 Å3 |
Cell temperature | 123 ± 2 K |
Ambient diffraction temperature | 123 ± 2 K |
Number of distinct elements | 4 |
Space group number | 2 |
Hermann-Mauguin space group symbol | P -1 |
Hall space group symbol | -P 1 |
Residual factor for all reflections | 0.0655 |
Residual factor for significantly intense reflections | 0.0543 |
Weighted residual factors for significantly intense reflections | 0.1419 |
Weighted residual factors for all reflections included in the refinement | 0.1503 |
Goodness-of-fit parameter for all reflections included in the refinement | 1.061 |
Diffraction radiation wavelength | 0.71073 Å |
Diffraction radiation type | MoKα |