Information card for entry 7038648
Common name | [Zn2(BDC)2(DABCO)] |
Formula | C22 H20 N2 O8 Zn2 |
Calculated formula | C22 H32 N2 O8 Zn2 |
Title of publication | The guest-dependent thermal response of the flexible MOF Zn2(BDC)2(DABCO). |
Authors of publication | Kim, Yonghwi; Haldar, Ritesh; Kim, Hyunuk; Koo, Jaehyoung; Kim, Kimoon |
Journal of publication | Dalton transactions (Cambridge, England : 2003) |
Year of publication | 2016 |
Journal volume | 45 |
Journal issue | 10 |
Pages of publication | 4187 - 4192 |
a | 10.9554 ± 0.0003 Å |
b | 10.9554 ± 0.0003 Å |
c | 9.5967 ± 0.0003 Å |
α | 90° |
β | 90° |
γ | 90° |
Cell volume | 1151.8 ± 0.06 Å3 |
Cell temperature | 150 ± 2 K |
Ambient diffraction temperature | 150 ± 2 K |
Number of distinct elements | 5 |
Space group number | 123 |
Hermann-Mauguin space group symbol | P 4/m m m |
Hall space group symbol | -P 4 2 |
Residual factor for all reflections | 0.0257 |
Residual factor for significantly intense reflections | 0.0236 |
Weighted residual factors for significantly intense reflections | 0.0556 |
Weighted residual factors for all reflections included in the refinement | 0.0568 |
Goodness-of-fit parameter for all reflections included in the refinement | 1.081 |
Diffraction radiation wavelength | 0.71073 Å |
Diffraction radiation type | MoKα |