Information card for entry 7038649
Common name | [Zn2(BDC)2(DABCO)] |
Formula | C22 H20 N2 O8 Zn2 |
Calculated formula | C22 H20 N2 O8 Zn2 |
Title of publication | The guest-dependent thermal response of the flexible MOF Zn2(BDC)2(DABCO). |
Authors of publication | Kim, Yonghwi; Haldar, Ritesh; Kim, Hyunuk; Koo, Jaehyoung; Kim, Kimoon |
Journal of publication | Dalton transactions (Cambridge, England : 2003) |
Year of publication | 2016 |
Journal volume | 45 |
Journal issue | 10 |
Pages of publication | 4187 - 4192 |
a | 15.4893 ± 0.0005 Å |
b | 15.4893 ± 0.0005 Å |
c | 9.5826 ± 0.0003 Å |
α | 90° |
β | 90° |
γ | 90° |
Cell volume | 2299.04 ± 0.13 Å3 |
Cell temperature | 100 ± 2 K |
Ambient diffraction temperature | 100 ± 2 K |
Number of distinct elements | 5 |
Space group number | 125 |
Hermann-Mauguin space group symbol | P 4/n b m |
Hall space group symbol | -P 4a 2b |
Residual factor for all reflections | 0.0351 |
Residual factor for significantly intense reflections | 0.0242 |
Weighted residual factors for significantly intense reflections | 0.056 |
Weighted residual factors for all reflections included in the refinement | 0.0633 |
Goodness-of-fit parameter for all reflections included in the refinement | 1.074 |
Diffraction radiation wavelength | 0.71073 Å |
Diffraction radiation type | MoKα |