Information card for entry 7038650
Common name | [Zn2(BDC)2(DABCO)],4DMF |
Formula | C34 H48 N6 O12 Zn2 |
Calculated formula | C34 H42 N6 O12 Zn2 |
Title of publication | The guest-dependent thermal response of the flexible MOF Zn2(BDC)2(DABCO). |
Authors of publication | Kim, Yonghwi; Haldar, Ritesh; Kim, Hyunuk; Koo, Jaehyoung; Kim, Kimoon |
Journal of publication | Dalton transactions (Cambridge, England : 2003) |
Year of publication | 2016 |
Journal volume | 45 |
Journal issue | 10 |
Pages of publication | 4187 - 4192 |
a | 15.0624 ± 0.0012 Å |
b | 15.0624 ± 0.0012 Å |
c | 19.2541 ± 0.0017 Å |
α | 90° |
β | 90° |
γ | 90° |
Cell volume | 4368.3 ± 0.6 Å3 |
Cell temperature | 298 ± 2 K |
Ambient diffraction temperature | 298 ± 2 K |
Number of distinct elements | 5 |
Space group number | 140 |
Hermann-Mauguin space group symbol | I 4/m c m |
Hall space group symbol | -I 4 2c |
Residual factor for all reflections | 0.0626 |
Residual factor for significantly intense reflections | 0.0396 |
Weighted residual factors for significantly intense reflections | 0.1093 |
Weighted residual factors for all reflections included in the refinement | 0.134 |
Goodness-of-fit parameter for all reflections included in the refinement | 1.042 |
Diffraction radiation wavelength | 0.71073 Å |
Diffraction radiation type | MoKα |