Information card for entry 7038694
Formula | C40 H96 Cl4 F12 P10 Re2 Si2 |
Calculated formula | C40 H98 Cl4 F12 P10 Re2 Si2 |
Title of publication | Electronic communication in phosphine substituted bridged dirhenium complexes - clarifying ambiguities raised by the redox non-innocence of the C4H2- and C4-bridges. |
Authors of publication | Li, Yan; Blacque, Olivier; Fox, Thomas; Luber, Sandra; Polit, Walther; Winter, Rainer F.; Venkatesan, Koushik; Berke, Heinz |
Journal of publication | Dalton transactions (Cambridge, England : 2003) |
Year of publication | 2016 |
Journal volume | 45 |
Journal issue | 13 |
Pages of publication | 5783 - 5799 |
a | 16.0272 ± 0.0004 Å |
b | 15.8081 ± 0.0003 Å |
c | 14.4694 ± 0.0003 Å |
α | 90° |
β | 90° |
γ | 90° |
Cell volume | 3665.96 ± 0.14 Å3 |
Cell temperature | 183 ± 2 K |
Ambient diffraction temperature | 183 ± 2 K |
Number of distinct elements | 7 |
Space group number | 58 |
Hermann-Mauguin space group symbol | P n n m |
Hall space group symbol | -P 2 2n |
Residual factor for all reflections | 0.0501 |
Residual factor for significantly intense reflections | 0.0308 |
Weighted residual factors for significantly intense reflections | 0.0674 |
Weighted residual factors for all reflections included in the refinement | 0.0704 |
Goodness-of-fit parameter for all reflections included in the refinement | 0.969 |
Diffraction radiation wavelength | 0.71073 Å |
Diffraction radiation type | MoKα |