Information card for entry 7038693
Formula | C80 H192 F12 O P18 Re4 Si4 |
Calculated formula | C80 H192 F12 O P18 Re4 Si4 |
Title of publication | Electronic communication in phosphine substituted bridged dirhenium complexes - clarifying ambiguities raised by the redox non-innocence of the C4H2- and C4-bridges. |
Authors of publication | Li, Yan; Blacque, Olivier; Fox, Thomas; Luber, Sandra; Polit, Walther; Winter, Rainer F.; Venkatesan, Koushik; Berke, Heinz |
Journal of publication | Dalton transactions (Cambridge, England : 2003) |
Year of publication | 2016 |
Journal volume | 45 |
Journal issue | 13 |
Pages of publication | 5783 - 5799 |
a | 10.0523 ± 0.0001 Å |
b | 21.424 ± 0.0002 Å |
c | 30.5215 ± 0.0003 Å |
α | 90° |
β | 92.588 ± 0.001° |
γ | 90° |
Cell volume | 6566.42 ± 0.11 Å3 |
Cell temperature | 183 ± 2 K |
Ambient diffraction temperature | 183 ± 2 K |
Number of distinct elements | 7 |
Space group number | 14 |
Hermann-Mauguin space group symbol | P 1 21/c 1 |
Hall space group symbol | -P 2ybc |
Residual factor for all reflections | 0.0649 |
Residual factor for significantly intense reflections | 0.0379 |
Weighted residual factors for significantly intense reflections | 0.1145 |
Weighted residual factors for all reflections included in the refinement | 0.1241 |
Goodness-of-fit parameter for all reflections included in the refinement | 0.879 |
Diffraction radiation wavelength | 0.71073 Å |
Diffraction radiation type | MoKα |