Information card for entry 7041314
Formula | C52 H76 N8 O16 Zn2 |
Calculated formula | C52 H76 N8 O16 Zn2 |
Title of publication | Synthesis and structural characterization of homochiral 2D coordination polymers of zinc and copper with conformationally flexible ditopic imidazolium-based dicarboxylate ligands. |
Authors of publication | Nicasio, Antonio I.; Montilla, Francisco; Álvarez, Eleuterio; Colodrero, Rosario P.; Galindo, Agustín |
Journal of publication | Dalton transactions (Cambridge, England : 2003) |
Year of publication | 2017 |
Journal volume | 46 |
Journal issue | 2 |
Pages of publication | 471 - 482 |
a | 13.1331 ± 0.0016 Å |
b | 19.104 ± 0.002 Å |
c | 24.643 ± 0.002 Å |
α | 90° |
β | 90° |
γ | 90° |
Cell volume | 6182.8 ± 1.1 Å3 |
Cell temperature | 213 ± 2 K |
Ambient diffraction temperature | 213 ± 2 K |
Number of distinct elements | 5 |
Space group number | 19 |
Hermann-Mauguin space group symbol | P 21 21 21 |
Hall space group symbol | P 2ac 2ab |
Residual factor for all reflections | 0.1014 |
Residual factor for significantly intense reflections | 0.0728 |
Weighted residual factors for significantly intense reflections | 0.1634 |
Weighted residual factors for all reflections included in the refinement | 0.2145 |
Goodness-of-fit parameter for all reflections included in the refinement | 1.038 |
Diffraction radiation wavelength | 0.71073 Å |
Diffraction radiation type | MoKα |