Information card for entry 7041315
Formula | C26 H38 Cu N4 O8 |
Calculated formula | C26 H38 Cu N4 O8 |
Title of publication | Synthesis and structural characterization of homochiral 2D coordination polymers of zinc and copper with conformationally flexible ditopic imidazolium-based dicarboxylate ligands. |
Authors of publication | Nicasio, Antonio I.; Montilla, Francisco; Álvarez, Eleuterio; Colodrero, Rosario P.; Galindo, Agustín |
Journal of publication | Dalton transactions (Cambridge, England : 2003) |
Year of publication | 2017 |
Journal volume | 46 |
Journal issue | 2 |
Pages of publication | 471 - 482 |
a | 6.7462 ± 0.0008 Å |
b | 10.0831 ± 0.0011 Å |
c | 10.6524 ± 0.0012 Å |
α | 87.226 ± 0.005° |
β | 83.19 ± 0.004° |
γ | 86.503 ± 0.004° |
Cell volume | 717.53 ± 0.14 Å3 |
Cell temperature | 193 ± 2 K |
Ambient diffraction temperature | 193 ± 2 K |
Number of distinct elements | 5 |
Space group number | 1 |
Hermann-Mauguin space group symbol | P 1 |
Hall space group symbol | P 1 |
Residual factor for all reflections | 0.0776 |
Residual factor for significantly intense reflections | 0.0767 |
Weighted residual factors for significantly intense reflections | 0.2057 |
Weighted residual factors for all reflections included in the refinement | 0.207 |
Goodness-of-fit parameter for all reflections included in the refinement | 1.043 |
Diffraction radiation wavelength | 0.71073 Å |
Diffraction radiation type | MoKα |