Information card for entry 7041366
Formula | C198 H333 Cl6 N42 Na4 Nd38 Ni42.5 O339 |
Calculated formula | C198 H190 Cl6 N42 Na4 Nd38 Ni42.5 O339 |
Title of publication | Isolation, structure and magnetic properties of two novel core-shell 3d-4f heterometallic nanoscale clusters. |
Authors of publication | Lin, Qingfang; Zhang, Yu; Cheng, Weiwei; Liu, Ying; Xu, Yan |
Journal of publication | Dalton transactions (Cambridge, England : 2003) |
Year of publication | 2017 |
Journal volume | 46 |
Journal issue | 3 |
Pages of publication | 643 - 646 |
a | 28.703 ± 0.003 Å |
b | 33.963 ± 0.003 Å |
c | 24.664 ± 0.003 Å |
α | 90° |
β | 90° |
γ | 90° |
Cell volume | 24043 ± 4 Å3 |
Cell temperature | 296 ± 2 K |
Ambient diffraction temperature | 296 ± 2 K |
Number of distinct elements | 8 |
Space group number | 58 |
Hermann-Mauguin space group symbol | P n n m |
Hall space group symbol | -P 2 2n |
Residual factor for all reflections | 0.1631 |
Residual factor for significantly intense reflections | 0.0688 |
Weighted residual factors for significantly intense reflections | 0.1723 |
Weighted residual factors for all reflections included in the refinement | 0.2109 |
Goodness-of-fit parameter for all reflections included in the refinement | 1.016 |
Diffraction radiation wavelength | 0.71073 Å |
Diffraction radiation type | MoKα |