Information card for entry 7041367
Formula | C180 H377 Cl10 N40 Na Ni38 O331 Pr42 |
Calculated formula | C180 H214 Cl10 N40 Na Ni38 O331 Pr42 |
Title of publication | Isolation, structure and magnetic properties of two novel core-shell 3d-4f heterometallic nanoscale clusters. |
Authors of publication | Lin, Qingfang; Zhang, Yu; Cheng, Weiwei; Liu, Ying; Xu, Yan |
Journal of publication | Dalton transactions (Cambridge, England : 2003) |
Year of publication | 2017 |
Journal volume | 46 |
Journal issue | 3 |
Pages of publication | 643 - 646 |
a | 22.761 ± 0.002 Å |
b | 28.178 ± 0.002 Å |
c | 35.469 ± 0.003 Å |
α | 90° |
β | 101.251 ± 0.001° |
γ | 90° |
Cell volume | 22311 ± 3 Å3 |
Cell temperature | 296 ± 2 K |
Ambient diffraction temperature | 296 ± 2 K |
Number of distinct elements | 8 |
Space group number | 14 |
Hermann-Mauguin space group symbol | P 1 21/n 1 |
Hall space group symbol | -P 2yn |
Residual factor for all reflections | 0.1391 |
Residual factor for significantly intense reflections | 0.0726 |
Weighted residual factors for significantly intense reflections | 0.181 |
Weighted residual factors for all reflections included in the refinement | 0.208 |
Goodness-of-fit parameter for all reflections included in the refinement | 1.085 |
Diffraction radiation wavelength | 0.71073 Å |
Diffraction radiation type | MoKα |