Information card for entry 7041951
Chemical name | Bis(2-(pyridin-2-ylmethylene)-1-(4-(p-tolyl)-1,3-selenazol-2-yl)hydrazin-1- ide-cobalt(III) tetrafluoridoborate |
Formula | C32 H26 B Co F4 N8 Se2 |
Calculated formula | C32 H26 B Co F4 N8 Se2 |
SMILES | [Co]1234([n]5c(cccc5)C=[N]1N=C1[Se]C=C(c5ccc(cc5)C)N21)N1C([Se]C=C1c1ccc(cc1)C)=N[N]3=Cc1cccc[n]41.[B](F)(F)(F)[F-] |
Title of publication | Co(iii) complexes of (1,3-selenazol-2-yl)hydrazones and their sulphur analogues. |
Authors of publication | Filipović, Nenad R; Elshaflu, Hana; Grubišić, Sonja; Jovanović, Ljiljana S; Rodić, Marko; Novaković, Irena; Malešević, Aleksandar; Djordjević, Ivana S; Li, Haidong; Šojić, Nešo; Marinković, Aleksandar; Todorović, Tamara R |
Journal of publication | Dalton transactions (Cambridge, England : 2003) |
Year of publication | 2017 |
Journal volume | 46 |
Journal issue | 9 |
Pages of publication | 2910 - 2924 |
a | 9.8772 ± 0.0002 Å |
b | 15.1645 ± 0.0004 Å |
c | 22.6936 ± 0.0004 Å |
α | 90° |
β | 90° |
γ | 90° |
Cell volume | 3399.11 ± 0.13 Å3 |
Cell temperature | 294 ± 2 K |
Ambient diffraction temperature | 294 ± 2 K |
Number of distinct elements | 7 |
Space group number | 19 |
Hermann-Mauguin space group symbol | P 21 21 21 |
Hall space group symbol | P 2ac 2ab |
Residual factor for all reflections | 0.0587 |
Residual factor for significantly intense reflections | 0.0379 |
Weighted residual factors for significantly intense reflections | 0.0872 |
Weighted residual factors for all reflections included in the refinement | 0.0956 |
Goodness-of-fit parameter for all reflections included in the refinement | 1.039 |
Diffraction radiation probe | x-ray |
Diffraction radiation wavelength | 0.71073 Å |
Diffraction radiation type | MoKα |