Information card for entry 7041952
Formula |
C39 H51 N8 O3 |
Calculated formula |
C39 H51 N8 O3 |
Title of publication |
Modulation of the CO2 fixation in dinickel azacryptands. |
Authors of publication |
Möller, F; Castañeda-Losada, L; Junqueira, J. R. C.; Miller, R. G.; Reback, M. L.; Mallick, B.; van Gastel, M.; Apfel, U.-P. |
Journal of publication |
Dalton transactions (Cambridge, England : 2003) |
Year of publication |
2017 |
Journal volume |
46 |
Journal issue |
17 |
Pages of publication |
5680 - 5688 |
a |
14.368 ± 0.002 Å |
b |
20.759 ± 0.002 Å |
c |
12.3557 ± 0.0009 Å |
α |
90° |
β |
90° |
γ |
90° |
Cell volume |
3685.3 ± 0.7 Å3 |
Cell temperature |
170 ± 2 K |
Ambient diffraction temperature |
170 ± 2 K |
Number of distinct elements |
4 |
Space group number |
33 |
Hermann-Mauguin space group symbol |
P n a 21 |
Hall space group symbol |
P 2c -2n |
Residual factor for all reflections |
0.1097 |
Residual factor for significantly intense reflections |
0.0629 |
Weighted residual factors for significantly intense reflections |
0.162 |
Weighted residual factors for all reflections included in the refinement |
0.1853 |
Goodness-of-fit parameter for all reflections included in the refinement |
0.873 |
Diffraction radiation wavelength |
0.71073 Å |
Diffraction radiation type |
MoKα |
Yes |
Yes |
No |