Information card for entry 7043872
Formula | C15 H21 Ho N2 O8 |
Calculated formula | C15 H21 Ho N2 O8 |
SMILES | [Ho]123([O]=C(C)C=C(O1)C)([O]=C(C)C=C(O2)C)(OC(=O)c1[n]3ccnc1)([OH2])[OH2] |
Title of publication | Novel mononuclear Ln complexes with pyrazine-2-carboxylate and acetylacetonate co-ligands: remarkable Single Molecule Magnet behavior of Yb derivative |
Authors of publication | Gavrikov, Andrey Vyacheslavovich; Efimov, Nikolay; Dobrohotova, Zhanna; Ilyukhin, Andrey Borisovich; Vasilyev, Pavel Nikolaevich; Novotortsev, Vladimir M. |
Journal of publication | Dalton Trans. |
Year of publication | 2017 |
a | 7.7665 ± 0.0004 Å |
b | 29.8018 ± 0.0015 Å |
c | 8.2632 ± 0.0004 Å |
α | 90° |
β | 105.868 ± 0.001° |
γ | 90° |
Cell volume | 1839.68 ± 0.16 Å3 |
Cell temperature | 150 ± 2 K |
Ambient diffraction temperature | 150 ± 2 K |
Number of distinct elements | 5 |
Space group number | 14 |
Hermann-Mauguin space group symbol | P 1 21/n 1 |
Hall space group symbol | -P 2yn |
Residual factor for all reflections | 0.0425 |
Residual factor for significantly intense reflections | 0.039 |
Weighted residual factors for significantly intense reflections | 0.0721 |
Weighted residual factors for all reflections included in the refinement | 0.0728 |
Goodness-of-fit parameter for all reflections included in the refinement | 1.562 |
Diffraction radiation wavelength | 0.71073 Å |
Diffraction radiation type | MoKα |