Information card for entry 7043873
Formula | C15 H21 Dy N2 O8 |
Calculated formula | C15 H21 Dy N2 O8 |
SMILES | [Dy]123([O]=C(C)C=C(O1)C)(OC(=CC(=[O]2)C)C)(OC(=O)c1[n]3ccnc1)([OH2])[OH2] |
Title of publication | Novel mononuclear Ln complexes with pyrazine-2-carboxylate and acetylacetonate co-ligands: remarkable Single Molecule Magnet behavior of Yb derivative |
Authors of publication | Gavrikov, Andrey Vyacheslavovich; Efimov, Nikolay; Dobrohotova, Zhanna; Ilyukhin, Andrey Borisovich; Vasilyev, Pavel Nikolaevich; Novotortsev, Vladimir M. |
Journal of publication | Dalton Trans. |
Year of publication | 2017 |
a | 7.79 ± 0.0005 Å |
b | 29.8733 ± 0.0018 Å |
c | 8.2641 ± 0.0005 Å |
α | 90° |
β | 105.941 ± 0.002° |
γ | 90° |
Cell volume | 1849.2 ± 0.2 Å3 |
Cell temperature | 173 ± 2 K |
Ambient diffraction temperature | 173 ± 2 K |
Number of distinct elements | 5 |
Space group number | 14 |
Hermann-Mauguin space group symbol | P 1 21/n 1 |
Hall space group symbol | -P 2yn |
Residual factor for all reflections | 0.0462 |
Residual factor for significantly intense reflections | 0.0434 |
Weighted residual factors for significantly intense reflections | 0.11 |
Weighted residual factors for all reflections included in the refinement | 0.1114 |
Goodness-of-fit parameter for all reflections included in the refinement | 1.222 |
Diffraction radiation wavelength | 0.71073 Å |
Diffraction radiation type | MoKα |